Reaction Details
TargetPlatelet-derived growth factor receptor beta
LigandBDBM50185170
Substrate/Competitorn/a
Meas. Tech.ChEMBL_374543 (CHEMBL862850)
IC50 690±n/a nM
Citation McBride, CMRenhowe, PAHeise, CJansen, JMLapointe, GMa, SPiñeda, RVora, JWiesmann, MShafer, CM Design and structure-activity relationship of 3-benzimidazol-2-yl-1H-indazoles as inhibitors of receptor tyrosine kinases. Bioorg Med Chem Lett16:3595-9 (2006) 
 
Platelet-derived growth factor receptor beta
Name:Platelet-derived growth factor receptor beta
Type:Enzyme
Mol. Mass.:122771.00
Organism:Mus musculus (mouse)
Description:P05622
Residue:1098
BDBM50185170
NameBDBM50185170
Synonyms:2-(1H-indazol-3-yl)-5-(4-(piperidin-1-yl)piperidin-1-yl)-1H-benzo[d]imidazole | CHEMBL378299
TypeSmall organic molecule
Emp. Form.C24H28N6
Mol. Mass.400.5193
SMILESC1CCN(CC1)C1CCN(CC1)c1ccc2nc([nH]c2c1)-c1n[nH]c2ccccc12