Reaction Details
TargetVascular endothelial growth factor receptor 1
LigandBDBM50185179
Substrate/Competitorn/a
Meas. Tech.ChEMBL_374542 (CHEMBL862849)
IC50 150±n/a nM
Citation McBride, CMRenhowe, PAHeise, CJansen, JMLapointe, GMa, SPiñeda, RVora, JWiesmann, MShafer, CM Design and structure-activity relationship of 3-benzimidazol-2-yl-1H-indazoles as inhibitors of receptor tyrosine kinases. Bioorg Med Chem Lett16:3595-9 (2006) 
 
Vascular endothelial growth factor receptor 1
Name:Vascular endothelial growth factor receptor 1
Type:Receptor Tyrosine Kinase
Mol. Mass.:150800.23
Organism:Homo sapiens (Human)
Description:P17948
Residue:1338
BDBM50185179
NameBDBM50185179
Synonyms:2-(7-fluoro-1H-indazol-3-yl)-5-(4-(piperidin-1-yl)piperidin-1-yl)-1H-benzo[d]imidazole | CHEMBL211940
TypeSmall organic molecule
Emp. Form.C24H27FN6
Mol. Mass.418.5098
SMILESFc1cccc2c(n[nH]c12)-c1nc2ccc(cc2[nH]1)N1CCC(CC1)N1CCCCC1