Reaction Details
TargetFibroblast growth factor receptor 1
LigandBDBM50185173
Substrate/Competitorn/a
Meas. Tech.ChEMBL_374544 (CHEMBL862851)
IC50 3±n/a nM
Citation McBride, CMRenhowe, PAHeise, CJansen, JMLapointe, GMa, SPiñeda, RVora, JWiesmann, MShafer, CM Design and structure-activity relationship of 3-benzimidazol-2-yl-1H-indazoles as inhibitors of receptor tyrosine kinases. Bioorg Med Chem Lett16:3595-9 (2006) 
 
Fibroblast growth factor receptor 1
Name:Fibroblast growth factor receptor 1
Type:Receptor
Mol. Mass.:91861.70
Organism:Homo sapiens (Human)
Description:P11362
Residue:822
BDBM50185173
NameBDBM50185173
Synonyms:1-tert-butyl-3-(3-(5-(4-(piperidin-1-yl)piperidin-1-yl)-1H-benzo[d]imidazol-2-yl)-1H-indazol-4-yl)urea | CHEMBL379740
TypeSmall organic molecule
Emp. Form.C29H38N8O
Mol. Mass.514.665
SMILESCC(C)(C)NC(=O)Nc1cccc2[nH]nc(-c3nc4ccc(cc4[nH]3)N3CCC(CC3)N3CCCCC3)c12