Reaction Details
TargetVascular endothelial growth factor receptor 2
LigandBDBM50185183
Substrate/Competitorn/a
Meas. Tech.ChEMBL_374541 (CHEMBL862848)
IC50 31±n/a nM
Citation McBride, CMRenhowe, PAHeise, CJansen, JMLapointe, GMa, SPiñeda, RVora, JWiesmann, MShafer, CM Design and structure-activity relationship of 3-benzimidazol-2-yl-1H-indazoles as inhibitors of receptor tyrosine kinases. Bioorg Med Chem Lett16:3595-9 (2006) 
 
Vascular endothelial growth factor receptor 2
Name:Vascular endothelial growth factor receptor 2
Type:PROTEIN
Mol. Mass.:152506.58
Organism:Mus musculus
Description:ChEMBL_1469997
Residue:1367
BDBM50185183
NameBDBM50185183
Synonyms:CHEMBL380372 | methyl 3-(5-(4-(piperidin-1-yl)piperidin-1-yl)-1H-benzo[d]imidazol-2-yl)-1H-indazole-5-carboxylate
TypeSmall organic molecule
Emp. Form.C26H30N6O2
Mol. Mass.458.5554
SMILESCOC(=O)c1ccc2[nH]nc(-c3nc4ccc(cc4[nH]3)N3CCC(CC3)N3CCCCC3)c2c1