Reaction Details
TargetVascular endothelial growth factor receptor 2
LigandBDBM50181305
Substrate/Competitorn/a
Meas. Tech.ChEMBL_374541 (CHEMBL862848)
IC50 25±n/a nM
Citation McBride, CMRenhowe, PAHeise, CJansen, JMLapointe, GMa, SPiñeda, RVora, JWiesmann, MShafer, CM Design and structure-activity relationship of 3-benzimidazol-2-yl-1H-indazoles as inhibitors of receptor tyrosine kinases. Bioorg Med Chem Lett16:3595-9 (2006) 
 
Vascular endothelial growth factor receptor 2
Name:Vascular endothelial growth factor receptor 2
Type:PROTEIN
Mol. Mass.:152506.58
Organism:Mus musculus
Description:ChEMBL_1469997
Residue:1367
BDBM50181305
NameBDBM50181305
Synonyms:4-amino-3-(1H-benzo[d]imidazol-2-yl)quinolin-2(1H)-one | CHEMBL383417
TypeSmall organic molecule
Emp. Form.C16H12N4O
Mol. Mass.276.2927
SMILESNc1c(-c2nc3ccccc3[nH]2)c(=O)[nH]c2ccccc12