Reaction Details
TargetVascular endothelial growth factor receptor 2
LigandBDBM50185176
Substrate/Competitorn/a
Meas. Tech.ChEMBL_374541 (CHEMBL862848)
IC50 660±n/a nM
Citation McBride, CMRenhowe, PAHeise, CJansen, JMLapointe, GMa, SPiñeda, RVora, JWiesmann, MShafer, CM Design and structure-activity relationship of 3-benzimidazol-2-yl-1H-indazoles as inhibitors of receptor tyrosine kinases. Bioorg Med Chem Lett16:3595-9 (2006) 
 
Vascular endothelial growth factor receptor 2
Name:Vascular endothelial growth factor receptor 2
Type:PROTEIN
Mol. Mass.:152506.58
Organism:Mus musculus
Description:ChEMBL_1469997
Residue:1367
BDBM50185176
NameBDBM50185176
Synonyms:2-(4-(benzyloxy)-1H-indazol-3-yl)-5-(4-(piperidin-1-yl)piperidin-1-yl)-1H-benzo[d]imidazole | CHEMBL425247
TypeSmall organic molecule
Emp. Form.C31H34N6O
Mol. Mass.506.6413
SMILESC(Oc1cccc2[nH]nc(-c3nc4ccc(cc4[nH]3)N3CCC(CC3)N3CCCCC3)c12)c1ccccc1