Reaction Details
TargetFibroblast growth factor receptor 1
LigandBDBM50185188
Substrate/Competitorn/a
Meas. Tech.ChEMBL_374544 (CHEMBL862851)
IC50 210±n/a nM
Citation McBride, CMRenhowe, PAHeise, CJansen, JMLapointe, GMa, SPiñeda, RVora, JWiesmann, MShafer, CM Design and structure-activity relationship of 3-benzimidazol-2-yl-1H-indazoles as inhibitors of receptor tyrosine kinases. Bioorg Med Chem Lett16:3595-9 (2006) 
 
Fibroblast growth factor receptor 1
Name:Fibroblast growth factor receptor 1
Type:Receptor
Mol. Mass.:91861.70
Organism:Homo sapiens (Human)
Description:P11362
Residue:822
BDBM50185188
NameBDBM50185188
Synonyms:5-(1H-imidazol-1-yl)-2-(1H-indazol-3-yl)-1H-benzo[d]imidazole | CHEMBL378003
TypeSmall organic molecule
Emp. Form.C17H12N6
Mol. Mass.300.3174
SMILESc1cn(cn1)-c1ccc2[nH]c(nc2c1)-c1n[nH]c2ccccc12