Reaction Details
TargetTyrosine-protein kinase Lyn
LigandBDBM4078
Substrate/Competitorn/a
Meas. Tech.ChEMBL_343253 (CHEMBL861012)
IC50 2900±n/a nM
Citation Cozza, GBonvini, PZorzi, EPoletto, GPagano, MASarno, SDonella-Deana, AZagotto, GRosolen, APinna, LAMeggio, FMoro, S Identification of ellagic acid as potent inhibitor of protein kinase CK2: a successful example of a virtual screening application. J Med Chem49:2363-6 (2006) 
 
Tyrosine-protein kinase Lyn
Name:Tyrosine-protein kinase Lyn
Type:PROTEIN
Mol. Mass.:58661.95
Organism:Rattus norvegicus
Description:ChEMBL_343253
Residue:512
BDBM4078
NameBDBM4078
Synonyms:6,7,13,14-tetrahydroxy-2,9-dioxatetracyclo[6.6.2.0^{4,16}.0^{11,15}]hexadeca-1(14),4(16),5,7,11(15),12-hexaene-3,10-dione ELLAGIC ACID Ellagic acid (18) MLS000069632 cid_5281855
TypeSmall organic molecule
Emp. Form.C14H6O8
Mol. Mass.302.1926
SMILESOc1cc2c3c(oc(=O)c4cc(O)c(O)c(oc2=O)c34)c1O