Reaction Details
TargetGamma-aminobutyric acid receptor subunit alpha-1/beta-3/gamma-2
LigandBDBM50185342
Substrate/Competitorn/a
Meas. Tech.ChEMBL_341839 (CHEMBL865018)
Ki 0.9±n/a nM
Citation Lewis, RTBlackaby, WPBlackburn, TJennings, ASPike, AWilson, RAHallett, DJCook, SMFerris, PMarshall, GRReynolds, DSSheppard, WFSmith, AJSohal, BStanley, JTye, SJWafford, KAAtack, JR A pyridazine series of alpha2/alpha3 subtype selective GABA A agonists for the treatment of anxiety. J Med Chem49:2600-10 (2006) 
 
Gamma-aminobutyric acid receptor subunit alpha-1/beta-3/gamma-2
Name:Gamma-aminobutyric acid receptor subunit alpha-1/beta-3/gamma-2
Type:Protein
Mol. Mass.:n/a
Description:n/a
Components:This complex has 3 components.
Component 1
Name:Gamma-aminobutyric acid receptor subunit alpha-1
Synonyms:Benzodiazepine central GABA A Benzodiazepine liver GABA(A) receptor subunit alpha-1 GABA-A receptor GBRA1_HUMAN TBPS | agonist GABA site
Type:Protein
Mol. Mass.:51817.35
Organism:Homo sapiens (Human)
Description:P14867
Residue:456
Component 2
Name:Gamma-aminobutyric acid receptor subunit beta-3
Synonyms:GABA A receptor alpha-4/beta-3/gamma-2 GABA-A receptor GBRB3_HUMAN | agonist GABA site
Type:PROTEIN
Mol. Mass.:54130.51
Organism:Homo sapiens (Human)
Description:ChEMBL_448071
Residue:473
Component 3
Name:Gamma-aminobutyric acid receptor subunit gamma-2
Synonyms:GABA(A) receptor subunit gamma-2 GBRG2_HUMAN
Type:PROTEIN
Mol. Mass.:54172.74
Organism:Homo sapiens (Human)
Description:EBI_217
Residue:467
BDBM50185342
NameBDBM50185342
Synonyms:5-[4-fluoro-3-(3-fluoropyridin-2-yl)-phenyl]-3-(3-fluoropyridin-4-yl)pyridazine | CHEMBL425934
TypeSmall organic molecule
Emp. Form.C20H11F3N4
Mol. Mass.364.3233
SMILESFc1ccc(cc1-c1ncccc1F)-c1cnnc(c1)-c1ccncc1F