Reaction Details
TargetCytosolic phospholipase A2
LigandBDBM50185354
Substrate/Competitorn/a
Meas. Tech.ChEMBL_341906 (CHEMBL863829)
IC50 4.3±n/a nM
Citation Ludwig, JBovens, SBrauch, CElfringhoff, ASLehr, M Design and synthesis of 1-indol-1-yl-propan-2-ones as inhibitors of human cytosolic phospholipase A2alpha. J Med Chem49:2611-20 (2006) 
 
Cytosolic phospholipase A2
Name:Cytosolic phospholipase A2
Type:Protein
Mol. Mass.:85219.30
Organism:Homo sapiens (Human)
Description:P47712
Residue:749
BDBM50185354
NameBDBM50185354
Synonyms:3-methylhydrogen 1-[3-(4-decyloxyphenoxy)-2-oxopropyl]indole-3,5-dicarboxylate | CHEMBL443834
TypeSmall organic molecule
Emp. Form.C30H37NO7
Mol. Mass.523.6173
SMILESCCCCCCCCCCOc1ccc(OCC(=O)Cn2cc(C(=O)OC)c3cc(ccc23)C(O)=O)cc1