Reaction Details
TargetNeuropeptide Y receptor type 2
LigandBDBM50185366
Substrate/Competitorn/a
Meas. Tech.ChEBML_344947
Ki 390±n/a nM
Citation Balasubramaniam, AMullins, DELin, SZhai, WTao, ZDhawan, VCGuzzi, MKnittel, JJSlack, KHerzog, HParker, EM Neuropeptide Y (NPY) Y4 receptor selective agonists based on NPY(32-36): development of an anorectic Y4 receptor selective agonist with picomolar affinity. J Med Chem49:2661-5 (2006) 
 
Neuropeptide Y receptor type 2
Name:Neuropeptide Y receptor type 2
Type:Enzyme Catalytic Domain
Mol. Mass.:42734.65
Organism:Homo sapiens (Human)
Description:NPY-Y2 NPY2R HUMAN::P49146
Residue:381
BDBM50185366
NameBDBM50185366
Synonyms:CHEMBL2371911 Sub[-Trp-Arg-Nva-Arg-Tyr-NH2]2
TypeSmall organic molecule
Emp. Form.C82H122N28O14
Mol. Mass.1724.0253
SMILESCCC[C@H](NC(=O)[C@H](CCCN=C(N)N)NC(=O)[C@H](Cc1c[nH]c2ccccc12)NC(=O)[C@@H](N)CCCC[C@H](N)C(=O)N[C@@H](Cc1c[nH]c2ccccc12)C(=O)N[C@@H](CCCN=C(N)N)C(=O)N[C@@H](CCC)C(=O)N[C@@H](CCCN=C(N)N)C(=O)N[C@@H](Cc1ccc(O)cc1)C(N)=O)C(=O)N[C@@H](CCCN=C(N)N)C(=O)N[C@@H](Cc1ccc(O)cc1)C(N)=O