Reaction Details
TargetSphingosine 1-phosphate receptor 2
LigandBDBM50185526
Substrate/Competitorn/a
Meas. Tech.ChEMBL_374027 (CHEMBL864689)
IC50>10000±n/a nM
Citation Yan, LBudhu, RHuo, PLynch, CLHale, JJMills, SGHajdu, RKeohane, CARosenbach, MJMilligan, JAShei, GJChrebet, GBergstrom, JCard, DMandala, SM 2-Aryl(pyrrolidin-4-yl)acetic acids are potent agonists of sphingosine-1-phosphate (S1P) receptors. Bioorg Med Chem Lett16:3564-8 (2006) 
 
Sphingosine 1-phosphate receptor 2
Name:Sphingosine 1-phosphate receptor 2
Type:G Protein-Coupled Receptor (GPCR)
Mol. Mass.:38883.16
Organism:Homo sapiens (Human)
Description:Membranes isolated from S1P2-transfected CHO cells were used in ligand binding assay.
Residue:353
BDBM50185526
NameBDBM50185526
Synonyms:2-(trans-5-(4-(5-(4-cyclohexylphenyl)-1,2,4-oxadiazol-3-yl)phenyl)pyrrolidin-3-yl)acetic acid | CHEMBL377828
TypeSmall organic molecule
Emp. Form.C26H29N3O3
Mol. Mass.431.5268
SMILESOC(=O)C[C@@H]1CN[C@H](C1)c1ccc(cc1)-c1noc(n1)-c1ccc(cc1)C1CCCCC1