Reaction Details
TargetSphingosine 1-phosphate receptor 2
LigandBDBM50158335
Substrate/Competitorn/a
Meas. Tech.ChEMBL_374027 (CHEMBL864689)
IC50>10000±n/a nM
Citation Yan, LBudhu, RHuo, PLynch, CLHale, JJMills, SGHajdu, RKeohane, CARosenbach, MJMilligan, JAShei, GJChrebet, GBergstrom, JCard, DMandala, SM 2-Aryl(pyrrolidin-4-yl)acetic acids are potent agonists of sphingosine-1-phosphate (S1P) receptors. Bioorg Med Chem Lett16:3564-8 (2006) 
 
Sphingosine 1-phosphate receptor 2
Name:Sphingosine 1-phosphate receptor 2
Type:G Protein-Coupled Receptor (GPCR)
Mol. Mass.:38883.16
Organism:Homo sapiens (Human)
Description:Membranes isolated from S1P2-transfected CHO cells were used in ligand binding assay.
Residue:353
BDBM50158335
NameBDBM50158335
Synonyms:1-(4-((4-phenyl-5-(trifluoromethyl)thiophen-2-yl)methoxy)benzyl)azetidine-3-carboxylic acid CHEMBL425563
TypeSmall organic molecule
Emp. Form.C23H20F3NO3S
Mol. Mass.447.47
SMILESOC(=O)C1CN(Cc2ccc(OCc3cc(c(s3)C(F)(F)F)-c3ccccc3)cc2)C1