Reaction Details
TargetDelta-type opioid receptor
LigandBDBM50185615
Substrate/Competitorn/a
Meas. Tech.ChEMBL_361576 (CHEMBL870153)
Ki>10000±n/a nM
Citation Harding, WWSchmidt, MTidgewell, KKannan, PHolden, KGDersch, CMRothman, RBPrisinzano, TE Synthetic studies of neoclerodane diterpenes from Salvia divinorum: selective modification of the furan ring. Bioorg Med Chem Lett16:3170-4 (2006) 
 
Delta-type opioid receptor
Name:Delta-type opioid receptor
Type:G Protein-Coupled Receptor (GPCR)
Mol. Mass.:40382.98
Organism:Homo sapiens (Human)
Description:Competition binding assays were carried out using membrane preparations from transfected HN9.10 cells that constitutively expressed the delta opioid receptor.
Residue:372
BDBM50185615
NameBDBM50185615
Synonyms:(2S,4aR,6aR,7R,9S,10aS,10bR)-methyl 9-acetoxy-6a,10b-dimethyl-4,10-dioxo-2-(1-(phenylsulfonyl)-1H-pyrrol-3-yl)-dodecahydro-1H-benzo[f]isochromene-7-carboxylate | CHEMBL210775
TypeSmall organic molecule
Emp. Form.C29H33NO9S
Mol. Mass.571.639
SMILESCOC(=O)[C@@H]1C[C@H](OC(C)=O)C(=O)[C@H]2[C@@]1(C)CC[C@H]1C(=O)O[C@@H](C[C@]21C)c1ccn(c1)S(=O)(=O)c1ccccc1