Reaction Details
TargetKappa-type opioid receptor
LigandBDBM50185616
Substrate/Competitorn/a
Meas. Tech.ChEMBL_361577 (CHEMBL870154)
Ki 1620±n/a nM
Citation Harding, WWSchmidt, MTidgewell, KKannan, PHolden, KGDersch, CMRothman, RBPrisinzano, TE Synthetic studies of neoclerodane diterpenes from Salvia divinorum: selective modification of the furan ring. Bioorg Med Chem Lett16:3170-4 (2006) 
 
Kappa-type opioid receptor
Name:Kappa-type opioid receptor
Type:G Protein-Coupled Receptor (GPCR)
Mol. Mass.:42648.76
Organism:Homo sapiens (Human)
Description:P41145
Residue:380
BDBM50185616
NameBDBM50185616
Synonyms:(2S,4aR,6aR,7R,9S,10aS,10bR)-methyl 9-acetoxy-2-(1-(4-methoxyphenylsulfonyl)-1H-pyrrol-3-yl)-6a,10b-dimethyl-4,10-dioxo-dodecahydro-1H-benzo[f]isochromene-7-carboxylate | CHEMBL378314
TypeSmall organic molecule
Emp. Form.C30H35NO10S
Mol. Mass.601.665
SMILESCOC(=O)[C@@H]1C[C@H](OC(C)=O)C(=O)[C@H]2[C@@]1(C)CC[C@H]1C(=O)O[C@@H](C[C@]21C)c1ccn(c1)S(=O)(=O)c1ccc(OC)cc1