Reaction Details
TargetC-C chemokine receptor type 5
LigandBDBM50185667
Substrate/Competitorn/a
Meas. Tech.ChEMBL_372909 (CHEMBL865374)
IC50 1.1±n/a nM
Citation Cumming, JGBrown, SJCooper, AEFaull, AWFlynn, APGrime, KOldfield, JShaw, JSShepherd, ETucker, HWhittaker, D Modulators of the human CCR5 receptor. Part 3: SAR of substituted 1-[3-(4-methanesulfonylphenyl)-3-phenylpropyl]-piperidinyl phenylacetamides. Bioorg Med Chem Lett16:3533-6 (2006) 
 
C-C chemokine receptor type 5
Name:C-C chemokine receptor type 5
Type:Enzyme
Mol. Mass.:40540.21
Organism:Homo sapiens (Human)
Description:P51681
Residue:352
BDBM50185667
NameBDBM50185667
Synonyms:(R)-N-(1-(3-(3-chloro-5-fluorophenyl)-3-(4-(methylsulfonyl)phenyl)propyl)piperidin-4-yl)-N-ethyl-2-(4-(methylsulfonyl)phenyl)acetamide | CHEMBL382435
TypeSmall organic molecule
Emp. Form.C32H38ClFN2O5S2
Mol. Mass.649.236
SMILESCCN(C1CCN(CC[C@H](c2ccc(cc2)S(C)(=O)=O)c2cc(F)cc(Cl)c2)CC1)C(=O)Cc1ccc(cc1)S(C)(=O)=O