Reaction Details
Target5-hydroxytryptamine receptor 2A
LigandBDBM50185775
Substrate/Competitorn/a
Meas. Tech.ChEMBL_361713 (CHEMBL861444)
Ki 0.87±n/a nM
Citation Ladduwahetty, TBoase, ALMitchinson, AQuin, CPatel, SChapman, KMacLeod, AM A new class of selective, non-basic 5-HT2A receptor antagonists. Bioorg Med Chem Lett16:3201-4 (2006) 
 
5-hydroxytryptamine receptor 2A
Name:5-hydroxytryptamine receptor 2A
Type:undefined
Mol. Mass.:52607.65
Organism:Homo sapiens (Human)
Description:P28223
Residue:471
BDBM50185775
NameBDBM50185775
Synonyms:7-(1-(2,4-difluorophenethyl)piperazine-4-carbonyl)-1H-indole-3-carbonitrile EMD-281014
TypeSmall organic molecule
Emp. Form.C22H20F2N4O
Mol. Mass.394.4172
SMILESFc1ccc(CCN2CCN(CC2)C(=O)c2cccc3c(c[nH]c23)C#N)c(F)c1