Reaction Details
TargetDelta-type opioid receptor
LigandBDBM50185799
Substrate/Competitorn/a
Meas. Tech.ChEMBL_372755 (CHEMBL871099)
Ki>5000±n/a nM
Citation Bignan, GCBattista, KConnolly, PJOrsini, MJLiu, JMiddleton, SAReitz, AB 3-(4-Piperidinyl)indoles and 3-(4-piperidinyl)pyrrolo-[2,3-b]pyridines as ligands for the ORL-1 receptor. Bioorg Med Chem Lett16:3524-8 (2006) 
 
Delta-type opioid receptor
Name:Delta-type opioid receptor
Type:G Protein-Coupled Receptor (GPCR)
Mol. Mass.:40382.98
Organism:Homo sapiens (Human)
Description:Competition binding assays were carried out using membrane preparations from transfected HN9.10 cells that constitutively expressed the delta opioid receptor.
Residue:372
BDBM50185799
NameBDBM50185799
Synonyms:1-(1,2-dihydroacenaphthylen-1-yl)-4-(1-methyl-1H-pyrrolo[2,3-b]pyridin-3-yl)piperidin-3-ol | CHEMBL212525
TypeSmall organic molecule
Emp. Form.C25H25N3O
Mol. Mass.383.4855
SMILESCn1cc(C2CCN(CC2O)C2Cc3cccc4cccc2c34)c2cccnc12