Reaction Details
TargetDelta-type opioid receptor
LigandBDBM50185796
Substrate/Competitorn/a
Meas. Tech.ChEMBL_372755 (CHEMBL871099)
Ki 2750±n/a nM
Citation Bignan, GCBattista, KConnolly, PJOrsini, MJLiu, JMiddleton, SAReitz, AB 3-(4-Piperidinyl)indoles and 3-(4-piperidinyl)pyrrolo-[2,3-b]pyridines as ligands for the ORL-1 receptor. Bioorg Med Chem Lett16:3524-8 (2006) 
 
Delta-type opioid receptor
Name:Delta-type opioid receptor
Type:G Protein-Coupled Receptor (GPCR)
Mol. Mass.:40382.98
Organism:Homo sapiens (Human)
Description:Competition binding assays were carried out using membrane preparations from transfected HN9.10 cells that constitutively expressed the delta opioid receptor.
Residue:372
BDBM50185796
NameBDBM50185796
Synonyms:5-chloro-3-(1-(1,2-dihydroacenaphthylen-1-yl)piperidin-4-yl)-2-methyl-1H-indole | CHEMBL212575
TypeSmall organic molecule
Emp. Form.C26H25ClN2
Mol. Mass.400.943
SMILESCc1[nH]c2ccc(Cl)cc2c1C1CCN(CC1)C1Cc2cccc3cccc1c23