Reaction Details
TargetDelta-type opioid receptor
LigandBDBM50185800
Substrate/Competitorn/a
Meas. Tech.ChEMBL_372755 (CHEMBL871099)
Ki>5000±n/a nM
Citation Bignan, GCBattista, KConnolly, PJOrsini, MJLiu, JMiddleton, SAReitz, AB 3-(4-Piperidinyl)indoles and 3-(4-piperidinyl)pyrrolo-[2,3-b]pyridines as ligands for the ORL-1 receptor. Bioorg Med Chem Lett16:3524-8 (2006) 
 
Delta-type opioid receptor
Name:Delta-type opioid receptor
Type:G Protein-Coupled Receptor (GPCR)
Mol. Mass.:40382.98
Organism:Homo sapiens (Human)
Description:Competition binding assays were carried out using membrane preparations from transfected HN9.10 cells that constitutively expressed the delta opioid receptor.
Residue:372
BDBM50185800
NameBDBM50185800
Synonyms:3-(1-(1,2-dihydroacenaphthylen-1-yl)piperidin-4-yl)-1H-pyrrolo[2,3-b]pyridine | CHEMBL379297
TypeSmall organic molecule
Emp. Form.C24H23N3
Mol. Mass.353.4595
SMILESC1C(N2CCC(CC2)c2c[nH]c3ncccc23)c2cccc3cccc1c23