Reaction Details
TargetKappa-type opioid receptor
LigandBDBM50185792
Substrate/Competitorn/a
Meas. Tech.ChEMBL_372754 (CHEMBL871098)
Ki 330±n/a nM
Citation Bignan, GCBattista, KConnolly, PJOrsini, MJLiu, JMiddleton, SAReitz, AB 3-(4-Piperidinyl)indoles and 3-(4-piperidinyl)pyrrolo-[2,3-b]pyridines as ligands for the ORL-1 receptor. Bioorg Med Chem Lett16:3524-8 (2006) 
 
Kappa-type opioid receptor
Name:Kappa-type opioid receptor
Type:G Protein-Coupled Receptor (GPCR)
Mol. Mass.:42648.76
Organism:Homo sapiens (Human)
Description:P41145
Residue:380
BDBM50185792
NameBDBM50185792
Synonyms:3-(1-benzylpiperidin-4-yl)-5-chloro-1H-indole | CHEMBL210770
TypeSmall organic molecule
Emp. Form.C20H21ClN2
Mol. Mass.324.847
SMILESClc1ccc2[nH]cc(C3CCN(Cc4ccccc4)CC3)c2c1