Reaction Details
TargetMu-type opioid receptor
LigandBDBM50185787
Substrate/Competitorn/a
Meas. Tech.ChEMBL_372753 (CHEMBL871097)
Ki>5000±n/a nM
Citation Bignan, GCBattista, KConnolly, PJOrsini, MJLiu, JMiddleton, SAReitz, AB 3-(4-Piperidinyl)indoles and 3-(4-piperidinyl)pyrrolo-[2,3-b]pyridines as ligands for the ORL-1 receptor. Bioorg Med Chem Lett16:3524-8 (2006) 
 
Mu-type opioid receptor
Name:Mu-type opioid receptor
Type:G Protein-Coupled Receptor (GPCR)
Mol. Mass.:44789.51
Organism:Homo sapiens (Human)
Description:P35372
Residue:400
BDBM50185787
NameBDBM50185787
Synonyms:3-(1-(cyclohexylmethyl)piperidin-4-yl)-1H-pyrrolo[2,3-b]pyridine | CHEMBL211210
TypeSmall organic molecule
Emp. Form.C19H27N3
Mol. Mass.297.4378
SMILESC(C1CCCCC1)N1CCC(CC1)c1c[nH]c2ncccc12