Reaction Details
TargetNociceptin receptor
LigandBDBM50185803
Substrate/Competitorn/a
Meas. Tech.ChEMBL_372756 (CHEMBL871100)
Ki 81±n/a nM
Citation Bignan, GCBattista, KConnolly, PJOrsini, MJLiu, JMiddleton, SAReitz, AB 3-(4-Piperidinyl)indoles and 3-(4-piperidinyl)pyrrolo-[2,3-b]pyridines as ligands for the ORL-1 receptor. Bioorg Med Chem Lett16:3524-8 (2006) 
 
Nociceptin receptor
Name:Nociceptin receptor
Type:G Protein-Coupled Receptor (GPCR)
Mol. Mass.:40702.87
Organism:Homo sapiens (Human)
Description:P41146
Residue:370
BDBM50185803
NameBDBM50185803
Synonyms:3-(1-(1,2-dihydroacenaphthylen-1-yl)piperidin-4-yl)-1-methyl-1H-pyrrolo[2,3-b]pyridine | CHEMBL379657
TypeSmall organic molecule
Emp. Form.C25H25N3
Mol. Mass.367.4861
SMILESCn1cc(C2CCN(CC2)C2Cc3cccc4cccc2c34)c2cccnc12