Reaction Details
TargetMu-type opioid receptor
LigandBDBM50185811
Substrate/Competitorn/a
Meas. Tech.ChEMBL_372753 (CHEMBL871097)
Ki 260±n/a nM
Citation Bignan, GCBattista, KConnolly, PJOrsini, MJLiu, JMiddleton, SAReitz, AB 3-(4-Piperidinyl)indoles and 3-(4-piperidinyl)pyrrolo-[2,3-b]pyridines as ligands for the ORL-1 receptor. Bioorg Med Chem Lett16:3524-8 (2006) 
 
Mu-type opioid receptor
Name:Mu-type opioid receptor
Type:G Protein-Coupled Receptor (GPCR)
Mol. Mass.:44789.51
Organism:Homo sapiens (Human)
Description:P35372
Residue:400
BDBM50185811
NameBDBM50185811
Synonyms:7-chloro-3-(1-(1,2-dihydroacenaphthylen-1-yl)piperidin-4-yl)-1H-indole | CHEMBL208862
TypeSmall organic molecule
Emp. Form.C25H23ClN2
Mol. Mass.386.917
SMILESClc1cccc2c(c[nH]c12)C1CCN(CC1)C1Cc2cccc3cccc1c23