Reaction Details
TargetMu-type opioid receptor
LigandBDBM50185799
Substrate/Competitorn/a
Meas. Tech.ChEMBL_372753 (CHEMBL871097)
Ki 170±n/a nM
Citation Bignan, GCBattista, KConnolly, PJOrsini, MJLiu, JMiddleton, SAReitz, AB 3-(4-Piperidinyl)indoles and 3-(4-piperidinyl)pyrrolo-[2,3-b]pyridines as ligands for the ORL-1 receptor. Bioorg Med Chem Lett16:3524-8 (2006) 
 
Mu-type opioid receptor
Name:Mu-type opioid receptor
Type:G Protein-Coupled Receptor (GPCR)
Mol. Mass.:44789.51
Organism:Homo sapiens (Human)
Description:P35372
Residue:400
BDBM50185799
NameBDBM50185799
Synonyms:1-(1,2-dihydroacenaphthylen-1-yl)-4-(1-methyl-1H-pyrrolo[2,3-b]pyridin-3-yl)piperidin-3-ol | CHEMBL212525
TypeSmall organic molecule
Emp. Form.C25H25N3O
Mol. Mass.383.4855
SMILESCn1cc(C2CCN(CC2O)C2Cc3cccc4cccc2c34)c2cccnc12