Reaction Details
TargetKappa-type opioid receptor
LigandBDBM50185809
Substrate/Competitorn/a
Meas. Tech.ChEMBL_372754 (CHEMBL871098)
Ki 1010±n/a nM
Citation Bignan, GCBattista, KConnolly, PJOrsini, MJLiu, JMiddleton, SAReitz, AB 3-(4-Piperidinyl)indoles and 3-(4-piperidinyl)pyrrolo-[2,3-b]pyridines as ligands for the ORL-1 receptor. Bioorg Med Chem Lett16:3524-8 (2006) 
 
Kappa-type opioid receptor
Name:Kappa-type opioid receptor
Type:G Protein-Coupled Receptor (GPCR)
Mol. Mass.:42648.76
Organism:Homo sapiens (Human)
Description:P41145
Residue:380
BDBM50185809
NameBDBM50185809
Synonyms:3-(1-benzyl-1,2,3,6-tetrahydropyridin-4-yl)-5-chloro-1H-indole | CHEMBL211723
TypeSmall organic molecule
Emp. Form.C20H19ClN2
Mol. Mass.322.831
SMILESClc1ccc2[nH]cc(C3=CCN(Cc4ccccc4)CC3)c2c1