Reaction Details
TargetMu-type opioid receptor
LigandBDBM50185792
Substrate/Competitorn/a
Meas. Tech.ChEMBL_372753 (CHEMBL871097)
Ki 230±n/a nM
Citation Bignan, GCBattista, KConnolly, PJOrsini, MJLiu, JMiddleton, SAReitz, AB 3-(4-Piperidinyl)indoles and 3-(4-piperidinyl)pyrrolo-[2,3-b]pyridines as ligands for the ORL-1 receptor. Bioorg Med Chem Lett16:3524-8 (2006) 
 
Mu-type opioid receptor
Name:Mu-type opioid receptor
Type:G Protein-Coupled Receptor (GPCR)
Mol. Mass.:44789.51
Organism:Homo sapiens (Human)
Description:P35372
Residue:400
BDBM50185792
NameBDBM50185792
Synonyms:3-(1-benzylpiperidin-4-yl)-5-chloro-1H-indole | CHEMBL210770
TypeSmall organic molecule
Emp. Form.C20H21ClN2
Mol. Mass.324.847
SMILESClc1ccc2[nH]cc(C3CCN(Cc4ccccc4)CC3)c2c1