Reaction Details
TargetNociceptin receptor
LigandBDBM50185800
Substrate/Competitorn/a
Meas. Tech.ChEMBL_372756 (CHEMBL871100)
Ki 4±n/a nM
Citation Bignan, GCBattista, KConnolly, PJOrsini, MJLiu, JMiddleton, SAReitz, AB 3-(4-Piperidinyl)indoles and 3-(4-piperidinyl)pyrrolo-[2,3-b]pyridines as ligands for the ORL-1 receptor. Bioorg Med Chem Lett16:3524-8 (2006) 
 
Nociceptin receptor
Name:Nociceptin receptor
Type:G Protein-Coupled Receptor (GPCR)
Mol. Mass.:40702.87
Organism:Homo sapiens (Human)
Description:P41146
Residue:370
BDBM50185800
NameBDBM50185800
Synonyms:3-(1-(1,2-dihydroacenaphthylen-1-yl)piperidin-4-yl)-1H-pyrrolo[2,3-b]pyridine | CHEMBL379297
TypeSmall organic molecule
Emp. Form.C24H23N3
Mol. Mass.353.4595
SMILESC1C(N2CCC(CC2)c2c[nH]c3ncccc23)c2cccc3cccc1c23