Reaction Details
TargetNociceptin receptor
LigandBDBM50185796
Substrate/Competitorn/a
Meas. Tech.ChEMBL_372756 (CHEMBL871100)
Ki 10±n/a nM
Citation Bignan, GCBattista, KConnolly, PJOrsini, MJLiu, JMiddleton, SAReitz, AB 3-(4-Piperidinyl)indoles and 3-(4-piperidinyl)pyrrolo-[2,3-b]pyridines as ligands for the ORL-1 receptor. Bioorg Med Chem Lett16:3524-8 (2006) 
 
Nociceptin receptor
Name:Nociceptin receptor
Type:G Protein-Coupled Receptor (GPCR)
Mol. Mass.:40702.87
Organism:Homo sapiens (Human)
Description:P41146
Residue:370
BDBM50185796
NameBDBM50185796
Synonyms:5-chloro-3-(1-(1,2-dihydroacenaphthylen-1-yl)piperidin-4-yl)-2-methyl-1H-indole | CHEMBL212575
TypeSmall organic molecule
Emp. Form.C26H25ClN2
Mol. Mass.400.943
SMILESCc1[nH]c2ccc(Cl)cc2c1C1CCN(CC1)C1Cc2cccc3cccc1c23