Reaction Details
TargetMatrix metalloproteinase-9
LigandBDBM50185900
Substrate/Competitorn/a
Meas. Tech.ChEMBL_361727 (CHEMBL870165)
IC50 0.960000±n/a nM
Citation Zhang, YMFan, XXiang, BChakravarty, DScannevin, RBurke, SKarnachi, PRhodes, KJackson, P Synthesis and SAR of alpha-sulfonylcarboxylic acids as potent matrix metalloproteinase inhibitors. Bioorg Med Chem Lett16:3096-100 (2006) 
 
Matrix metalloproteinase-9
Name:Matrix metalloproteinase-9
Type:Enzyme
Mol. Mass.:78452.28
Organism:Homo sapiens (Human)
Description:P14780
Residue:707
BDBM50185900
NameBDBM50185900
Synonyms:4-(1,3-dioxo-1,3-dihydro-isoindol-2-yl)-2-(4'-methylsulfanyl-biphenyl-4-sulfonyl)-butyric acid | CHEMBL209165
TypeSmall organic molecule
Emp. Form.C25H21NO6S2
Mol. Mass.495.567
SMILESCSc1ccc(cc1)-c1ccc(cc1)S(=O)(=O)C(CCN1C(=O)c2ccccc2C1=O)C(O)=O