Reaction Details
Target72 kDa type IV collagenase
LigandBDBM50185890
Substrate/Competitorn/a
Meas. Tech.ChEMBL_361726 (CHEMBL870164)
IC50 1.1±n/a nM
Citation Zhang, YMFan, XXiang, BChakravarty, DScannevin, RBurke, SKarnachi, PRhodes, KJackson, P Synthesis and SAR of alpha-sulfonylcarboxylic acids as potent matrix metalloproteinase inhibitors. Bioorg Med Chem Lett16:3096-100 (2006) 
 
72 kDa type IV collagenase
Name:72 kDa type IV collagenase
Type:Enzyme
Mol. Mass.:73870.36
Organism:Homo sapiens (Human)
Description: P08253
Residue:660
BDBM50185890
NameBDBM50185890
Synonyms:4-(1,3-dioxo-1,3-dihydro-isoindol-2-yl)-2-[4-(4-propyl-phenylethynyl)-phenylsulfanyl]-butyric acid | CHEMBL211036
TypeSmall organic molecule
Emp. Form.C29H25NO4S
Mol. Mass.483.578
SMILESCCCc1ccc(cc1)C#Cc1ccc(SC(CCN2C(=O)c3ccccc3C2=O)C(O)=O)cc1