Reaction Details
Target72 kDa type IV collagenase
LigandBDBM50185898
Substrate/Competitorn/a
Meas. Tech.ChEMBL_361726 (CHEMBL870164)
IC50 2.3±n/a nM
Citation Zhang, YMFan, XXiang, BChakravarty, DScannevin, RBurke, SKarnachi, PRhodes, KJackson, P Synthesis and SAR of alpha-sulfonylcarboxylic acids as potent matrix metalloproteinase inhibitors. Bioorg Med Chem Lett16:3096-100 (2006) 
 
72 kDa type IV collagenase
Name:72 kDa type IV collagenase
Type:Enzyme
Mol. Mass.:73870.36
Organism:Homo sapiens (Human)
Description: P08253
Residue:660
BDBM50185898
NameBDBM50185898
Synonyms:2-[4-(4-butyl-phenylethynyl)-phenylsulfanyl]-4-(1,3-dioxo-1,3-dihydro-isoindol-2-yl)-butyric acid | CHEMBL208615
TypeSmall organic molecule
Emp. Form.C30H27NO4S
Mol. Mass.497.605
SMILESCCCCc1ccc(cc1)C#Cc1ccc(SC(CCN2C(=O)c3ccccc3C2=O)C(O)=O)cc1