Reaction Details
Target72 kDa type IV collagenase
LigandBDBM50185871
Substrate/Competitorn/a
Meas. Tech.ChEMBL_361726 (CHEMBL870164)
IC50 0.700000±n/a nM
Citation Zhang, YMFan, XXiang, BChakravarty, DScannevin, RBurke, SKarnachi, PRhodes, KJackson, P Synthesis and SAR of alpha-sulfonylcarboxylic acids as potent matrix metalloproteinase inhibitors. Bioorg Med Chem Lett16:3096-100 (2006) 
 
72 kDa type IV collagenase
Name:72 kDa type IV collagenase
Type:Enzyme
Mol. Mass.:73870.36
Organism:Homo sapiens (Human)
Description: P08253
Residue:660
BDBM50185871
NameBDBM50185871
Synonyms:4-(1,3-dioxo-1,3-dihydro-isoindol-2-yl)-2-[4-(5-fluoro-1H-benzoimidazol-2-yl)-benzenesulfonyl]-butyric acid | CHEMBL210441
TypeSmall organic molecule
Emp. Form.C25H18FN3O6S
Mol. Mass.507.49
SMILESOC(=O)C(CCN1C(=O)c2ccccc2C1=O)S(=O)(=O)c1ccc(cc1)-c1nc2ccc(F)cc2[nH]1