Reaction Details
TargetC-C chemokine receptor type 8
LigandBDBM50185902
Substrate/Competitorn/a
Meas. Tech.ChEMBL_351818 (CHEMBL867801)
Ki 60±n/a nM
Citation Ghosh, SElder, AGuo, JMani, UPatane, MCarson, KYe, QBennett, RChi, SJenkins, TGuan, BKolbeck, RSmith, SZhang, CLaRosa, GJaffee, BYang, HEddy, PLu, CUttamsingh, VHorlick, RHarriman, GFlynn, D Design, synthesis, and progress toward optimization of potent small molecule antagonists of CC chemokine receptor 8 (CCR8). J Med Chem49:2669-72 (2006) 
 
C-C chemokine receptor type 8
Name:C-C chemokine receptor type 8
Type:PROTEIN
Mol. Mass.:40855.53
Organism:Homo sapiens (Human)
Description:ChEMBL_454278
Residue:355
BDBM50185902
NameBDBM50185902
Synonyms:1-[3-(2-methoxy-phenoxy)-benzyl]-4-[(4-phenyl-piperidine-4-carbonyl)-amino]-piperidine-4-carboxylic acid | CHEMBL379834
TypeSmall organic molecule
Emp. Form.C32H37N3O5
Mol. Mass.543.6533
SMILESCOc1ccccc1Oc1cccc(CN2CCC(CC2)(NC(=O)C2(CCNCC2)c2ccccc2)C(O)=O)c1