Reaction Details
TargetC-C chemokine receptor type 8
LigandBDBM50185911
Substrate/Competitorn/a
Meas. Tech.ChEMBL_351818 (CHEMBL867801)
Ki 1400±n/a nM
Citation Ghosh, SElder, AGuo, JMani, UPatane, MCarson, KYe, QBennett, RChi, SJenkins, TGuan, BKolbeck, RSmith, SZhang, CLaRosa, GJaffee, BYang, HEddy, PLu, CUttamsingh, VHorlick, RHarriman, GFlynn, D Design, synthesis, and progress toward optimization of potent small molecule antagonists of CC chemokine receptor 8 (CCR8). J Med Chem49:2669-72 (2006) 
 
C-C chemokine receptor type 8
Name:C-C chemokine receptor type 8
Type:PROTEIN
Mol. Mass.:40855.53
Organism:Homo sapiens (Human)
Description:ChEMBL_454278
Residue:355
BDBM50185911
NameBDBM50185911
Synonyms:CHEMBL205692 | N-[1-(3-phenoxy-benzyl)-piperidin-4-yl]-2-phenyl-acetamide
TypeSmall organic molecule
Emp. Form.C26H28N2O2
Mol. Mass.400.5127
SMILESO=C(Cc1ccccc1)NC1CCN(Cc2cccc(Oc3ccccc3)c2)CC1