Reaction Details
TargetC-C chemokine receptor type 8
LigandBDBM50185914
Substrate/Competitorn/a
Meas. Tech.ChEMBL_351818 (CHEMBL867801)
Ki>30000±n/a nM
Citation Ghosh, SElder, AGuo, JMani, UPatane, MCarson, KYe, QBennett, RChi, SJenkins, TGuan, BKolbeck, RSmith, SZhang, CLaRosa, GJaffee, BYang, HEddy, PLu, CUttamsingh, VHorlick, RHarriman, GFlynn, D Design, synthesis, and progress toward optimization of potent small molecule antagonists of CC chemokine receptor 8 (CCR8). J Med Chem49:2669-72 (2006) 
 
C-C chemokine receptor type 8
Name:C-C chemokine receptor type 8
Type:PROTEIN
Mol. Mass.:40855.53
Organism:Homo sapiens (Human)
Description:ChEMBL_454278
Residue:355
BDBM50185914
NameBDBM50185914
Synonyms:1-(3-phenoxybenzyl)piperidine-4-carboxylic acid | CHEMBL377931
TypeSmall organic molecule
Emp. Form.C19H21NO3
Mol. Mass.311.3749
SMILESOC(=O)C1CCN(Cc2cccc(Oc3ccccc3)c2)CC1