Reaction Details
TargetC-C chemokine receptor type 8
LigandBDBM50185905
Substrate/Competitorn/a
Meas. Tech.ChEMBL_351818 (CHEMBL867801)
Ki 62±n/a nM
Citation Ghosh, SElder, AGuo, JMani, UPatane, MCarson, KYe, QBennett, RChi, SJenkins, TGuan, BKolbeck, RSmith, SZhang, CLaRosa, GJaffee, BYang, HEddy, PLu, CUttamsingh, VHorlick, RHarriman, GFlynn, D Design, synthesis, and progress toward optimization of potent small molecule antagonists of CC chemokine receptor 8 (CCR8). J Med Chem49:2669-72 (2006) 
 
C-C chemokine receptor type 8
Name:C-C chemokine receptor type 8
Type:PROTEIN
Mol. Mass.:40855.53
Organism:Homo sapiens (Human)
Description:ChEMBL_454278
Residue:355
BDBM50185905
NameBDBM50185905
Synonyms:4-phenyl-piperidine-4-carboxylic acid {1-[3-(2-methoxy-phenoxy)-benzyl]-piperidin-4-yl}-amide | CHEMBL205447
TypeSmall organic molecule
Emp. Form.C31H37N3O3
Mol. Mass.499.6438
SMILESCOc1ccccc1Oc1cccc(CN2CCC(CC2)NC(=O)C2(CCNCC2)c2ccccc2)c1