Reaction Details
TargetPeroxisome proliferator-activated receptor gamma
LigandBDBM50185944
Substrate/Competitorn/a
Meas. Tech.ChEMBL_352524 (CHEMBL861995)
EC50 0.78±n/a nM
Citation Lu, ILHuang, CFPeng, YHLin, YTHsieh, HPChen, CTLien, TWLee, HJMahindroo, NPrakash, EYueh, AChen, HYGoparaju, CMChen, XLiao, CCChao, YSHsu, JTWu, SY Structure-based drug design of a novel family of PPARgamma partial agonists: virtual screening, X-ray crystallography, and in vitro/in vivo biological activities. J Med Chem49:2703-12 (2006) 
 
Peroxisome proliferator-activated receptor gamma
Name:Peroxisome proliferator-activated receptor gamma
Type:Nuclear Receptor
Mol. Mass.:57613.46
Organism:Homo sapiens (Human)
Description:P37231
Residue:505
BDBM50185944
NameBDBM50185944
Synonyms:CHEMBL208472 N-[1-(4-FLUOROPHENYL)-3-(2-THIENYL)-1H-PYRAZOL-5-YL]-3,5-BIS(TRIFLUOROMETHYL)BENZENESULFONAMIDE
TypeSmall organic molecule
Emp. Form.C21H12F7N3O2S2
Mol. Mass.535.458
SMILESFc1ccc(cc1)-n1nc(cc1NS(=O)(=O)c1cc(cc(c1)C(F)(F)F)C(F)(F)F)-c1cccs1