Reaction Details
TargetPeroxisome proliferator-activated receptor gamma
LigandBDBM50185942
Substrate/Competitorn/a
Meas. Tech.ChEMBL_352521 (CHEMBL860010)
IC50 175±n/a nM
Citation Lu, ILHuang, CFPeng, YHLin, YTHsieh, HPChen, CTLien, TWLee, HJMahindroo, NPrakash, EYueh, AChen, HYGoparaju, CMChen, XLiao, CCChao, YSHsu, JTWu, SY Structure-based drug design of a novel family of PPARgamma partial agonists: virtual screening, X-ray crystallography, and in vitro/in vivo biological activities. J Med Chem49:2703-12 (2006) 
 
Peroxisome proliferator-activated receptor gamma
Name:Peroxisome proliferator-activated receptor gamma
Type:Nuclear Receptor
Mol. Mass.:57613.46
Organism:Homo sapiens (Human)
Description:P37231
Residue:505
BDBM50185942
NameBDBM50185942
Synonyms:(N-[1-(4-fluorophenyl)-3-(2-thienyl)-1H-pyrazol-5-yl]-5-[5-(tri-fluoromethyl)isoxazol-3-yl]-thiophene-2-sulfonamide | CHEMBL383233
TypeSmall organic molecule
Emp. Form.C21H12F4N4O3S3
Mol. Mass.540.534
SMILESFc1ccc(cc1)-n1nc(cc1NS(=O)(=O)c1ccc(s1)-c1cc(on1)C(F)(F)F)-c1cccs1