Reaction Details
TargetAmyloid-beta precursor protein
LigandBDBM50173647
Substrate/Competitorn/a
Meas. Tech.ChEMBL_351636 (CHEMBL861972)
Ki 6±n/a nM
Citation Ono, MKawashima, HNonaka, AKawai, THaratake, MMori, HKung, MPKung, HFSaji, HNakayama, M Novel benzofuran derivatives for PET imaging of beta-amyloid plaques in Alzheimer's disease brains. J Med Chem49:2725-30 (2006) 
 
Amyloid-beta precursor protein
Name:Amyloid-beta precursor protein
Type:Single-pass type I membrane protein
Mol. Mass.:86890.41
Organism:Homo sapiens (Human)
Description:P05067
Residue:770
BDBM50173647
NameBDBM50173647
Synonyms:(E)-4-(4-(methylamino)styryl)phenol 4-N-methylamino-4'-hydroxystilbene CHEMBL381642 [3H]-4-(4-(methylamino)styryl)phenol
TypeSmall organic molecule
Emp. Form.C15H15NO
Mol. Mass.225.2857
SMILESCNc1ccc(\C=C\c2ccc(O)cc2)cc1