Reaction Details
TargetC-C chemokine receptor type 5
LigandBDBM50185969
Substrate/Competitorn/a
Meas. Tech.ChEMBL_351942 (CHEMBL870788)
IC50 5.1±n/a nM
Citation Imamura, SIchikawa, TNishikawa, YKanzaki, NTakashima, KNiwa, SIizawa, YBaba, MSugihara, Y Discovery of a piperidine-4-carboxamide CCR5 antagonist (TAK-220) with highly potent Anti-HIV-1 activity. J Med Chem49:2784-93 (2006) 
 
C-C chemokine receptor type 5
Name:C-C chemokine receptor type 5
Type:Enzyme
Mol. Mass.:40540.21
Organism:Homo sapiens (Human)
Description:P51681
Residue:352
BDBM50185969
NameBDBM50185969
Synonyms:CHEMBL264832 | N-(3,4-dichlorophenyl)-N-(3-{4-[4-(methylcarbamoyl)benzyl]-piperidin-1-yl}propyl)-1-(methylsulfonyl)piperidine-4-carboxamide
TypeSmall organic molecule
Emp. Form.C30H40Cl2N4O4S
Mol. Mass.623.634
SMILESCNC(=O)c1ccc(CC2CCN(CCCN(C(=O)C3CCN(CC3)S(C)(=O)=O)c3ccc(Cl)c(Cl)c3)CC2)cc1