Reaction Details
TargetC-C chemokine receptor type 5
LigandBDBM50185966
Substrate/Competitorn/a
Meas. Tech.ChEMBL_351942 (CHEMBL870788)
IC50 12±n/a nM
Citation Imamura, SIchikawa, TNishikawa, YKanzaki, NTakashima, KNiwa, SIizawa, YBaba, MSugihara, Y Discovery of a piperidine-4-carboxamide CCR5 antagonist (TAK-220) with highly potent Anti-HIV-1 activity. J Med Chem49:2784-93 (2006) 
 
C-C chemokine receptor type 5
Name:C-C chemokine receptor type 5
Type:Enzyme
Mol. Mass.:40540.21
Organism:Homo sapiens (Human)
Description:P51681
Residue:352
BDBM50185966
NameBDBM50185966
Synonyms:CHEMBL206088 | N-{3-[4-(2-carbamoylbenzyl)piperidin-1-yl]propyl}-N-(3,4-dichlorophenyl)-1-(methylsulfonyl)piperidine-4-carboxamide
TypeSmall organic molecule
Emp. Form.C29H38Cl2N4O4S
Mol. Mass.609.607
SMILESCS(=O)(=O)N1CCC(CC1)C(=O)N(CCCN1CCC(Cc2ccccc2C(N)=O)CC1)c1ccc(Cl)c(Cl)c1