Reaction Details
TargetC-C chemokine receptor type 5
LigandBDBM50185963
Substrate/Competitorn/a
Meas. Tech.ChEMBL_351942 (CHEMBL870788)
IC50 1.7±n/a nM
Citation Imamura, SIchikawa, TNishikawa, YKanzaki, NTakashima, KNiwa, SIizawa, YBaba, MSugihara, Y Discovery of a piperidine-4-carboxamide CCR5 antagonist (TAK-220) with highly potent Anti-HIV-1 activity. J Med Chem49:2784-93 (2006) 
 
C-C chemokine receptor type 5
Name:C-C chemokine receptor type 5
Type:Enzyme
Mol. Mass.:40540.21
Organism:Homo sapiens (Human)
Description:P51681
Residue:352
BDBM50185963
NameBDBM50185963
Synonyms:1-acetyl-N-(3,4-dichlorophenyl)-N-(3-{4-[(4-fluorophenyl)sulfanyl]piperidin-1-yl}propyl)piperidine-4-carboxamide | CHEMBL437494
TypeSmall organic molecule
Emp. Form.C28H34Cl2FN3O2S
Mol. Mass.566.558
SMILESCC(=O)N1CCC(CC1)C(=O)N(CCCN1CCC(CC1)Sc1ccc(F)cc1)c1ccc(Cl)c(Cl)c1