Reaction Details
TargetAmyloid-beta precursor protein
LigandBDBM50122787
Substrate/Competitorn/a
Meas. Tech.ChEMBL_353056 (CHEMBL865747)
Ki 5±n/a nM
Citation Zhuang, ZPKung, MPKung, HF Synthesis of biphenyltrienes as probes for beta-amyloid plaques. J Med Chem49:2841-4 (2006) 
 
Amyloid-beta precursor protein
Name:Amyloid-beta precursor protein
Type:Single-pass type I membrane protein
Mol. Mass.:86890.41
Organism:Homo sapiens (Human)
Description:P05067
Residue:770
BDBM50122787
NameBDBM50122787
Synonyms:2-(4'-dimethylaminophenyl)-6-iodoimidazo[1,2-a]pyridine 4-(6-iodoimidazo[1,2-a]pyridin-2-yl)-N,N-dimethylaniline 6-iodo-2-(4'-dimethylamino)phenyl-imidazo[1,2-a]pyridine CHEMBL78012 | [4-(6-Iodo-imidazo[1,2-a]pyridin-2-yl)-phenyl]-dimethyl-amine
TypeSmall organic molecule
Emp. Form.C15H14IN3
Mol. Mass.363.1962
SMILESCN(C)c1ccc(cc1)-c1cn2cc(I)ccc2n1