Reaction Details
TargetAmyloid-beta precursor protein
LigandBDBM50185988
Substrate/Competitorn/a
Meas. Tech.ChEMBL_353055 (CHEMBL866263)
Ki>8000±n/a nM
Citation Zhuang, ZPKung, MPKung, HF Synthesis of biphenyltrienes as probes for beta-amyloid plaques. J Med Chem49:2841-4 (2006) 
 
Amyloid-beta precursor protein
Name:Amyloid-beta precursor protein
Type:Single-pass type I membrane protein
Mol. Mass.:86890.41
Organism:Homo sapiens (Human)
Description:P05067
Residue:770
BDBM50185988
NameBDBM50185988
Synonyms:1,6-bis(4'-methoxyphenyl)-hexa-1,3,5-triene | CHEMBL379363
TypeSmall organic molecule
Emp. Form.C20H20O2
Mol. Mass.292.3716
SMILESCOc1ccc(\C=C\C=C\C=C\c2ccc(OC)cc2)cc1