Reaction Details
TargetAmyloid-beta precursor protein
LigandBDBM50185989
Substrate/Competitorn/a
Meas. Tech.ChEMBL_353056 (CHEMBL865747)
Ki 500±n/a nM
Citation Zhuang, ZPKung, MPKung, HF Synthesis of biphenyltrienes as probes for beta-amyloid plaques. J Med Chem49:2841-4 (2006) 
 
Amyloid-beta precursor protein
Name:Amyloid-beta precursor protein
Type:Single-pass type I membrane protein
Mol. Mass.:86890.41
Organism:Homo sapiens (Human)
Description:P05067
Residue:770
BDBM50185989
NameBDBM50185989
Synonyms:1,6-bis(4'-nitrophenyl)-hexa-1,3,5-triene | CHEMBL205899
TypeSmall organic molecule
Emp. Form.C18H14N2O4
Mol. Mass.322.3148
SMILES[O-][N+](=O)c1ccc(\C=C\C=C\C=C\c2ccc(cc2)[N+]([O-])=O)cc1