Reaction Details
TargetAmyloid-beta precursor protein
LigandBDBM50185993
Substrate/Competitorn/a
Meas. Tech.ChEMBL_353056 (CHEMBL865747)
Ki 12±n/a nM
Citation Zhuang, ZPKung, MPKung, HF Synthesis of biphenyltrienes as probes for beta-amyloid plaques. J Med Chem49:2841-4 (2006) 
 
Amyloid-beta precursor protein
Name:Amyloid-beta precursor protein
Type:Single-pass type I membrane protein
Mol. Mass.:86890.41
Organism:Homo sapiens (Human)
Description:P05067
Residue:770
BDBM50185993
NameBDBM50185993
Synonyms:1-(4'-aminophenyl)-6-[4'-(2'-fluoroethylamino)phenyl]-hexa-1,3,5-triene | CHEMBL205332
TypeSmall organic molecule
Emp. Form.C20H21FN2
Mol. Mass.308.3925
SMILESNc1ccc(\C=C\C=C\C=C\c2ccc(NCCF)cc2)cc1