Reaction Details
TargetLong-chain fatty acid transport protein 4
LigandBDBM50186041
Substrate/Competitorn/a
Meas. Tech.ChEMBL_372182 (CHEMBL870441)
IC50 150±n/a nM
Citation Blackburn, CGuan, BBrown, JCullis, CCondon, SMJenkins, TJPeluso, SYe, YGimeno, REPunreddy, SSun, YWu, HHubbard, BKaushik, VTummino, PSanchetti, PYu Sun, DDaniels, TTozzo, EBalani, SKRaman, P Identification and characterization of 4-aryl-3,4-dihydropyrimidin-2(1H)-ones as inhibitors of the fatty acid transporter FATP4. Bioorg Med Chem Lett16:3504-9 (2006) 
 
Long-chain fatty acid transport protein 4
Name:Long-chain fatty acid transport protein 4
Type:PROTEIN
Mol. Mass.:72079.54
Organism:Homo sapiens (Human)
Description:ChEMBL_372182
Residue:643
BDBM50186041
NameBDBM50186041
Synonyms:(trans)-4-ethylcyclohexyl 6-methyl-4-(4-nitrophenyl)-2-oxo-1,2,3,4-tetrahydropyrimidine-5-carboxylate | CHEMBL211612
TypeSmall organic molecule
Emp. Form.C20H25N3O5
Mol. Mass.387.4296
SMILESCC[C@H]1CC[C@@H](CC1)OC(=O)C1C(NC(=O)N=C1C)c1ccc(cc1)[N+]([O-])=O