Reaction Details
TargetMalonyl-CoA decarboxylase, mitochondrial
LigandBDBM50186052
Substrate/Competitorn/a
Meas. Tech.ChEMBL_371874 (CHEMBL871585)
IC50 20±n/a nM
Citation Cheng, JFMak, CCHuang, YPenuliar, RNishimoto, MZhang, LChen, MWallace, DArrhenius, TChu, DYang, GBarbosa, MBarr, RDyck, JRLopaschuk, GDNadzan, AM Heteroaryl substituted bis-trifluoromethyl carbinols as malonyl-CoA decarboxylase inhibitors. Bioorg Med Chem Lett16:3484-8 (2006) 
 
Malonyl-CoA decarboxylase, mitochondrial
Name:Malonyl-CoA decarboxylase, mitochondrial
Type:PROTEIN
Mol. Mass.:55018.37
Organism:Homo sapiens (Human)
Description:ChEMBL_665404
Residue:493
BDBM50186052
NameBDBM50186052
Synonyms:CHEMBL210190 | N-(4-cyanobenzyl)-N-(5-(1,1,1,3,3,3-hexafluoro-2-hydroxypropan-2-yl)thiazol-2-yl)isobutyramide
TypeSmall organic molecule
Emp. Form.C18H15F6N3O2S
Mol. Mass.451.386
SMILESCC(C)C(=O)N(Cc1ccc(cc1)C#N)c1ncc(s1)C(O)(C(F)(F)F)C(F)(F)F