Reaction Details
TargetRNA-directed RNA polymerase
LigandBDBM50186150
Substrate/Competitorn/a
Meas. Tech.ChEMBL_369598 (CHEMBL865371)
IC50 2.8±n/a nM
Citation Chris Krueger, AMadigan, DLJiang, WWKati, WMLiu, DLiu, YMaring, CJMasse, SMcDaniel, KFMiddleton, TMo, HMolla, AMontgomery, DPratt, JKRockway, TWZhang, RKempf, DJ Inhibitors of HCV NS5B polymerase: synthesis and structure-activity relationships of N-alkyl-4-hydroxyquinolon-3-yl-benzothiadiazine sulfamides. Bioorg Med Chem Lett16:3367-70 (2006) 
 
RNA-directed RNA polymerase
Name:RNA-directed RNA polymerase
Type:Protein
Mol. Mass.:25173.95
Organism:Hepatitis C virus
Description:Q8JXU8
Residue:229
BDBM50186150
NameBDBM50186150
Synonyms:CHEMBL208740 | N-{3-[4-hydroxy-1-(3-methylbutyl)-2-oxo-1,2-dihydro-1,8-naphthyridin-3-yl]-1,1-dioxo-4H-1,2,4-benzothiadiazin-7-yl}aminosulfonamide
TypeSmall organic molecule
Emp. Form.C20H22N6O6S2
Mol. Mass.506.555
SMILESCC(C)CCn1c2ncccc2c(O)c(C2=Nc3ccc(NS(N)(=O)=O)cc3S(=O)(=O)N2)c1=O